{"text_format":"3","workbook":"xlsx","n_sheets":4,"sheets":["VDR Code","Schedule","VDR DOCTYPE","Справочник для бумаги"],"not_rendered":{"macros":1,"external_links":2,"defined_names":27},"read":"whole","date_system":"1900"}

{"sheet":"VDR Code","index":0,"n_rows":303,"n_cols":4,"rows_kept":303,"hidden":true}
["A01","Vendor Master Document Register","Главный реестр документации Поставщика"]
["A02","List of detailed drawings included in the main set, and general instructions","Ведомость рабочих чертежей основного комплекта и общие указания"]
["B01","Manufacture / Production Schedule","График изготовления / производства"]
["B02","Subordering Schedule","График субзаказов"]
["B03","Weekly Progress/Monthly Progress Reports","Еженедельные / ежемесячные отчеты о ходе выполнения работ"]
["B04","Vendor Profile","Характеристика Поставщика"]
["B05","Customer List","Перечень заказчиков"]
["B06","Certificate of Origin","Свидетельство о происхождении"]
["B07","Certificate of Conformity","Сертификат соответствия"]
["B08","Exceptions to Regulatory and Technical Requirements ","Исключения из нормативных и технических требований"]
["B09","Specification for Certification of Equipment and Materials ","Спецификация для сертификации оборудования и материалов"]
["B99",null,null,"Специальный раздел - может быть указано произвольное наименование"]
["C01","General arrangement drawings ","Общие компоновочные чертежи"]
["C02","Foundation Loading Diagrams & Support Details","Схемы нагрузок на фундаменты и детали опор"]
["C03","Detail drawings","Деталировочные чертежи"]
["C04","Exploded View/Cross Sectional Drawings","Покомпонентные изображения / чертежи поперечных сечений"]
["C05","Detailed Drawings of Mechanical Seals","Деталировочные чертежи механических уплотнений"]
["C06","Panel Cabinet Layouts","Компоновочные чертежи панелей"]
["C07","Electrical/Instrument Layouts","Планы расположения электрооборудования и аппаратуры КИПиА"]
["C08","Instrument Outline Drawings","Схематические чертежи КИПиА"]
{"$rows_left_out":284}
{"sheet":"Schedule","index":1,"n_rows":96,"n_cols":23,"rows_kept":96,"merged":[[0,0,0,18],[2,4,2,5],[2,8,2,10],[2,11,2,12],[4,4,4,5],[4,6,4,16],[5,1,5,2],[5,3,5,4],[5,8,5,11],[5,13,5,15],[5,19,5,20],[6,0,6,18],[6,19,6,20],[7,0,8,0],[7,1,8,1],[7,2,8,2],[7,3,8,3],[7,4,8,4],[7,5,8,5],[7,6,8,6],[7,7,8,7],[7,8,8,8],[7,9,8,9],[7,10,8,10],[7,11,8,11],[7,12,8,12],[7,13,8,13],[7,14,8,14],[7,15,8,15],[7,16,8,16],[7,17,8,17],[7,18,8,18],[7,19,8,19],[7,20,8,20],[7,21,8,21],[7,22,8,22]]}
["Приложение 1 График Предоставления Документов\nAttachment 1 Document Delivery Schedule",{"$nulls":19},"Lot No./ \nЛот №","Date of the letter of guarantee\nДата гарантийного письма"]
[{"$nulls":20},"XXXXXX","1990-01-01"]
["Owner Project No./\n№ проекта Заказчика","CPP.0034.2024",null,null,"Data sheet Number /\n№ Опросного листа",null,"CPP.0034.2024-3500-TX.DS-0005",{"$nulls":14},"Delivery Date\nДата поставки"]
[{"$nulls":21},"1990-07-01"]
[{"$nulls":4},"Tag No./\nТеговый номер",null,"[Tag Number here]\nУказать теговые номера"]
[]
[{"$nulls":19},"To be filled in by Vendor\nЗаполняет поставщик"]
["OWNER Document number\nНомер документа Заказчика\n\n","WBS\nИСР"," VDR code\nКод документа поставщика","Document sequential number\nПорядковый номер документа","Language\nЯзык док-та","English Document Title\nНазвание документа на английском языке\n","Russian Document Title\nНазвание документа на русском языке","Item / tag  No.\n№ позиции, теговый номер","Penalty\nШтрафные санкции","with bid \n предоставить с предложением","Weeks after letter of guarantee\n(First issue)\nНедели после гарантийного письма\n(Первый выпуск)","Weeks to Delivery Date\nНедели до даты поставки","Required for shipping release\nТребуется для разрешения отгрузки ","Remarks\nПримечания","Req. in Operation Manual\nТребуется в составе РЭ (руководства по эксплуатации)","Req. in Passport \n(acc. relevant T-SA Specification)\nТребуется в составе Паспорта ","Req. in MRB\nТребуется в составе MRB (Журнал производственных данных)","Hard Copy Original\nТребуется бумажная версия","Document required for DD\nДокумент, участвующий в разработке РД","Vendor's consent  (document will be provided in the specified date)\nСогласие Поставщика (документ будет предоставлен в указанный срок)\n(+ / -)","Rejection Reason\nПричина отклонения","Schedule date for first submission\nДата первого предоставления","Final issue\nФинальный выпуск"]
[]
[1,2,3,4,5,6,7,8,9,10,11,12,13,14,15,16,17,18,19,20,21,22,23]
[{"$nulls":5},"! ENGINEERING DOCUMENTS (РКД)"]
[{"$f":"IF(B12=\"\",\"\", (CONCATENATE($B$3,\"-\",B12,\"-\",$U$2,\"-\",C12,\"-\",D12)))","v":"CPP.0034.2024-3500-XXXXXX-A01-0001"},"3500","A01","0001","(RU)",{"$f":"IF(VLOOKUP($C12,'VDR Code'!$A:$C,2,0)=0,\"\",VLOOKUP($C12,'VDR Code'!$A:$C,2,0))","v":"Vendor Master Document Register"},{"$f":"IF(VLOOKUP($C12,'VDR Code'!$A:$C,3,0)=0,\"\",VLOOKUP($C12,'VDR Code'!$A:$C,3,0))","v":"Главный реестр документации Поставщика"},"All items\nВсе позиции","P",null,1,{"$nulls":5},"X",{"$nulls":4},{"$f":"IF(AND(NOT(K12=\"\"),NOT(L12=\"\")),\"\",IF(AND(NOT($V$2=\"\"),NOT($V$4=\"\")),IF(NOT(K12=\"\"),$V$2+(7*K12),IF(NOT(L12=\"\"),$V$4+(7*L12),\"with bid / с предложением\")),\"\"))","v":"1990-01-08"},{"$f":"V12+30","v":"1990-02-07"}]
[{"$nulls":4},"(RU)","Data Sheets","Опросные листы на оборудование","All items\nВсе позиции",null,"x",{"$nulls":3},"In native format and pdf signed and printed\nВ ред. формате и в pdf с подписью и печатью",{"$nulls":7},{"$f":"IF(AND(NOT(K13=\"\"),NOT(L13=\"\")),\"\",IF(AND(NOT($V$2=\"\"),NOT($V$4=\"\")),IF(NOT(K13=\"\"),$V$2+(7*K13),IF(NOT(L13=\"\"),$V$4+(7*L13),\"with bid / с предложением\")),\"\"))","v":"with bid / с предложением"}]
[{"$nulls":4},"(RU)","Deviation/Alternatives Table","Реестр отступлений от требований","All items\nВсе позиции",null,"x",{"$nulls":3},"In native format and pdf signed and printed\nВ ред. формате и в pdf с подписью и печатью",{"$nulls":7},"with bid / с предложением"]
[{"$f":"IF(B15=\"\",\"\", (CONCATENATE($B$3,\"-\",B15,\"-\",$U$2,\"-\",C15,\"-\",D15)))","v":"CPP.0034.2024-3500-XXXXXX-C01-0001"},"3500","C01","0001","(RU)",{"$f":"IF(VLOOKUP($C15,'VDR Code'!$A:$C,2,0)=0,\"\",VLOOKUP($C15,'VDR Code'!$A:$C,2,0))","v":"General arrangement drawings "},{"$f":"IF(VLOOKUP($C15,'VDR Code'!$A:$C,3,0)=0,\"\",VLOOKUP($C15,'VDR Code'!$A:$C,3,0))","v":"Общие компоновочные чертежи"},"All items\nВсе позиции","P",null,1,{"$nulls":7},"X",null,null,"1990-01-08",{"$f":"V15+30","v":"1990-02-07"}]
["CPP.0034.2024-3500-XXXXXX-C02-0001","3500","C02","0001","(RU)",{"$f":"IF(VLOOKUP($C16,'VDR Code'!$A:$C,2,0)=0,\"\",VLOOKUP($C16,'VDR Code'!$A:$C,2,0))","v":"Foundation Loading Diagrams & Support Details"},{"$f":"IF(VLOOKUP($C16,'VDR Code'!$A:$C,3,0)=0,\"\",VLOOKUP($C16,'VDR Code'!$A:$C,3,0))","v":"Схемы нагрузок на фундаменты и детали опор"},"All items\nВсе позиции","P",null,1,{"$nulls":7},"X",null,null,"1990-01-08","1990-02-07"]
[{"$f":"IF(B17=\"\",\"\", (CONCATENATE($B$3,\"-\",B17,\"-\",$U$2,\"-\",C17,\"-\",D17)))","v":"CPP.0034.2024-3500-XXXXXX-C03-0001"},"3500","C03","0001","(RU)",{"$f":"IF(VLOOKUP($C17,'VDR Code'!$A:$C,2,0)=0,\"\",VLOOKUP($C17,'VDR Code'!$A:$C,2,0))","v":"Detail drawings"},{"$f":"IF(VLOOKUP($C17,'VDR Code'!$A:$C,3,0)=0,\"\",VLOOKUP($C17,'VDR Code'!$A:$C,3,0))","v":"Деталировочные чертежи"},"All items\nВсе позиции","P",null,3,{"$nulls":7},"X",null,null,{"$f":"IF(AND(NOT(K17=\"\"),NOT(L17=\"\")),\"\",IF(AND(NOT($V$2=\"\"),NOT($V$4=\"\")),IF(NOT(K17=\"\"),$V$2+(7*K17),IF(NOT(L17=\"\"),$V$4+(7*L17),\"with bid / с предложением\")),\"\"))","v":"1990-01-22"},"1990-02-21"]
["CPP.0034.2024-3500-XXXXXX-C07-0001","3500","C07","0001","(RU)",{"$f":"IF(VLOOKUP($C18,'VDR Code'!$A:$C,2,0)=0,\"\",VLOOKUP($C18,'VDR Code'!$A:$C,2,0))","v":"Electrical/Instrument Layouts"},{"$f":"IF(VLOOKUP($C18,'VDR Code'!$A:$C,3,0)=0,\"\",VLOOKUP($C18,'VDR Code'!$A:$C,3,0))","v":"Планы расположения электрооборудования и аппаратуры КИПиА"},"All items\nВсе позиции","P",null,2,null,null,"При наличии комплектующих",{"$nulls":4},"X",null,null,"1990-01-15","1990-02-14"]
[{"$f":"IF(B19=\"\",\"\", (CONCATENATE($B$3,\"-\",B19,\"-\",$U$2,\"-\",C19,\"-\",D19)))","v":"CPP.0034.2024-3500-XXXXXX-C09-0001"},"3500","C09","0001","(RU)",{"$f":"IF(VLOOKUP($C19,'VDR Code'!$A:$C,2,0)=0,\"\",VLOOKUP($C19,'VDR Code'!$A:$C,2,0))","v":"Heat Insulation/Inner Coating Details"},{"$f":"IF(VLOOKUP($C19,'VDR Code'!$A:$C,3,0)=0,\"\",VLOOKUP($C19,'VDR Code'!$A:$C,3,0))","v":"Детали теплоизоляции / внутренних покрытий"},"All items\nВсе позиции",null,null,4,null,null,"Допускается отразить в С01",{"$nulls":7},{"$f":"IF(AND(NOT(K19=\"\"),NOT(L19=\"\")),\"\",IF(AND(NOT($V$2=\"\"),NOT($V$4=\"\")),IF(NOT(K19=\"\"),$V$2+(7*K19),IF(NOT(L19=\"\"),$V$4+(7*L19),\"with bid / с предложением\")),\"\"))","v":"1990-01-29"},{"$f":"V19+30","v":"1990-02-28"}]
["CPP.0034.2024-3500-XXXXXX-C14-0001","3500","C14","0001","(RU)",{"$f":"IF(VLOOKUP($C20,'VDR Code'!$A:$C,2,0)=0,\"\",VLOOKUP($C20,'VDR Code'!$A:$C,2,0))","v":"Nameplate Format Drawings"},{"$f":"IF(VLOOKUP($C20,'VDR Code'!$A:$C,3,0)=0,\"\",VLOOKUP($C20,'VDR Code'!$A:$C,3,0))","v":"Чертежи паспортных табличек"},"All items\nВсе позиции",null,null,6,{"$nulls":10},"1990-02-12","1990-03-14"]
{"$rows_left_out":77}
{"sheet":"VDR DOCTYPE","index":2,"n_rows":995,"n_cols":5,"rows_kept":995,"merged":[[3,0,8,0],[3,1,8,1],[3,2,8,2],[9,0,11,0],[9,1,11,1],[9,2,11,2],[13,0,18,0],[13,1,18,1],[13,2,18,2],[19,0,21,0],[19,1,21,1],[19,2,21,2],[22,0,37,0],[22,1,37,1],[22,2,37,2],[41,0,46,0],[41,1,46,1],[41,2,46,2],[49,0,50,0],[49,1,50,1],[49,2,50,2],[49,3,50,3],[49,4,50,4],[52,0,72,0],[52,1,72,1],[52,2,72,2],[73,0,79,0],[73,1,79,1],[73,2,79,2],[80,0,94,0],[80,1,94,1],[80,2,94,2],[97,0,101,0],[97,1,101,1],[97,2,101,2],[102,0,110,0],[102,1,110,1],[102,2,110,2],[111,0,121,0],[111,1,121,1],[111,2,121,2],[124,0,126,0],[124,1,126,1],[124,2,126,2],[127,0,139,0],[127,1,139,1],[127,2,139,2],[143,0,144,0],[143,1,144,1],[143,2,144,2],[146,0,149,0],[146,1,149,1],[146,2,149,2],[151,0,153,0],[151,1,153,1],[151,2,153,2],[156,0,159,0],[156,1,159,1],[156,2,159,2],[161,0,162,0],[161,1,162,1],[161,2,162,2],[163,0,164,0],[163,1,164,1],[163,2,164,2],[165,0,166,0],[165,1,166,1],[165,2,166,2],[171,0,176,0],[171,1,176,1],[171,2,176,2],[177,0,209,0],[177,1,209,1],[177,2,209,2],[210,0,218,0],[210,1,218,1],[210,2,218,2],[219,0,221,0],[219,1,221,1],[219,2,221,2],[222,0,229,0],[222,1,229,1],[222,2,229,2],[230,0,236,0],[230,1,236,1],[230,2,236,2],[237,0,244,0],[237,1,244,1],[237,2,244,2],[245,0,248,0],[245,1,248,1],[245,2,248,2],[249,0,255,0],[249,1,255,1],[249,2,255,2],[257,0,262,0],[257,1,262,1],[257,2,262,2],[263,0,267,0],[263,1,267,1],[263,2,267,2],[268,0,271,0],[268,1,271,1],[268,2,271,2],[272,0,273,0],[272,1,273,1],[272,2,273,2],[283,0,285,0],[283,1,285,1],[283,2,285,2],[294,0,312,0],[294,1,312,1],[294,2,312,2],[316,0,327,0],[316,1,327,1],[316,2,327,2],[330,0,334,0],[330,1,334,1],[330,2,334,2],[338,0,349,0],[338,1,349,1],[338,2,349,2],[350,0,362,0],[350,1,362,1],[350,2,362,2],[363,0,371,0],[363,1,371,1],[363,2,371,2],[378,0,381,0],[378,1,381,1],[378,2,381,2],[384,0,385,0],[384,1,385,1],[384,2,385,2],[386,0,387,0],[386,1,387,1],[386,2,387,2],[389,0,390,0],[389,1,390,1],[389,2,390,2],[392,0,396,0],[392,1,396,1],[392,2,396,2],[399,0,402,0],[399,1,402,1],[399,2,402,2],[403,0,405,0],[403,1,405,1],[403,2,405,2],[406,0,409,0],[406,1,409,1],[406,2,409,2],[412,0,434,0],[412,1,434,1],[412,2,434,2],[435,0,441,0],[435,1,441,1],[435,2,441,2],[442,0,446,0],[442,1,446,1],[442,2,446,2],[448,0,453,0],[448,1,453,1],[448,2,453,2],[455,0,456,0],[455,1,456,1],[455,2,456,2],[457,0,461,0],[457,1,461,1],[457,2,461,2],[462,0,468,0],[462,1,468,1],[462,2,468,2],[472,0,473,0],[472,1,473,1],[472,2,473,2],[474,0,477,0],[474,1,477,1],[474,2,477,2],[478,0,490,0],[478,1,490,1],[478,2,490,2],[493,0,500,0],[493,1,500,1],[493,2,500,2],[505,0,506,0],[505,1,506,1],[505,2,506,2],[510,0,513,0],[510,1,513,1],[510,2,513,2],[514,0,515,0],[514,1,515,1],[514,2,515,2],[518,0,519,0],[518,1,519,1],[518,2,519,2],[520,0,523,0],[520,1,523,1],[520,2,523,2],[524,0,526,0],[524,1,526,1],[524,2,526,2],[527,0,529,0],[527,1,529,1],[527,2,529,2],[530,0,532,0],[530,1,532,1],[530,2,532,2],[533,0,536,0],[533,1,536,1],[533,2,536,2],[539,0,542,0],[539,1,542,1],[539,2,542,2],[543,0,545,0],[543,1,545,1],[543,2,545,2],[546,0,549,0],[546,1,549,1],[546,2,549,2],[550,0,554,0],[550,1,554,1],[550,2,554,2],[559,0,570,0],[559,1,570,1],[559,2,570,2],[571,0,576,0],[571,1,576,1],[571,2,576,2],[578,0,580,0],[578,1,580,1],[578,2,580,2],[588,0,590,0],[588,1,590,1],[588,2,590,2],[592,0,598,0],[592,1,598,1],[592,2,598,2],[604,0,605,0],[604,1,605,1],[604,2,605,2],[606,0,607,0],[606,1,607,1],[606,2,607,2],[610,0,611,0],[610,1,611,1],[610,2,611,2],[612,0,613,0],[612,1,613,1],[612,2,613,2],[615,0,616,0],[615,1,616,1],[615,2,616,2],[617,0,620,0],[617,1,620,1],[617,2,620,2],[621,0,624,0],[621,1,624,1],[621,2,624,2],[627,0,628,0],[627,1,628,1],[627,2,628,2],[629,0,635,0],[629,1,635,1],[629,2,635,2],[636,0,638,0],[636,1,638,1],[636,2,638,2],[639,0,640,0],[639,1,640,1],[639,2,640,2],[649,0,658,0],[649,1,658,1],[649,2,658,2],[659,0,660,0],[659,1,660,1],[659,2,660,2],[661,0,662,0],[661,1,662,1],[661,2,662,2],[663,0,669,0],[663,1,669,1],[663,2,669,2],[671,0,673,0],[671,1,673,1],[671,2,673,2],[675,0,676,0],[675,1,676,1],[675,2,676,2],[680,0,683,0],[680,1,683,1],[680,2,683,2],[684,0,685,0],[684,1,685,1],[684,2,685,2],[688,0,689,0],[688,1,689,1],[688,2,689,2],[700,0,701,0],[700,1,701,1],[700,2,701,2],[703,0,717,0],[703,1,717,1],[703,2,717,2],[719,0,726,0],[719,1,726,1],[719,2,726,2],[763,0,765,0],[763,1,765,1],[766,0,767,0],[766,1,767,1],[768,0,769,0],[768,1,769,1],[771,0,772,0],[771,1,772,1],[777,0,782,0],[777,1,782,1],[777,2,782,2],[784,0,793,0],[784,1,793,1],[784,2,793,2],[797,0,808,0],[797,1,808,1],[797,2,808,2],[812,0,818,0],[812,1,818,1],[812,2,818,2],[820,0,824,0],[820,1,824,1],[820,2,824,2],[829,0,840,0],[829,1,840,1],[829,2,840,2],[841,0,843,0],[841,1,843,1],[841,2,843,2],[844,0,846,0],[844,1,846,1],[844,2,846,2],[847,0,848,0],[847,1,848,1],[847,2,848,2],[850,0,856,0],[850,1,856,1],[850,2,856,2],[858,0,859,0],[858,1,859,1],[858,2,859,2],[860,0,861,0],[860,1,861,1],[860,2,861,2],[862,0,873,0],[862,1,873,1],[862,2,873,2],[874,0,876,0],[874,1,876,1],[874,2,876,2],[877,0,899,0],[877,1,899,1],[877,2,899,2],[900,0,933,0],[900,1,933,1],[900,2,933,2],[934,0,936,0],[934,1,936,1],[934,2,936,2],[937,0,971,0],[937,1,971,1],[937,2,971,2],[972,0,981,0],[972,1,981,1],[972,2,981,2],[982,0,983,0],[982,1,983,1],[982,2,983,2],[982,4,983,4],[984,0,985,0],[984,1,985,1],[984,2,985,2],[984,4,985,4],[986,0,989,0],[986,1,989,1],[986,2,989,2],[986,4,987,4],[990,0,991,0],[990,1,991,1],[990,2,991,2],[992,0,993,0],[992,1,993,1],[992,2,993,2],[992,4,993,4],[994,0,995,0],[994,1,995,1],[994,2,995,2],[994,3,995,3],[994,4,995,4]]}
[null,"Detail Design for Vendors / Описание кодов"]
[" VDR Code","Title","Наименование","Description","Описание"]
[null,"A - Vendor Master Document Schedule","A - Главный реестр документации Поставщика"]
["A01","Vendor Document Register (VDR)","Главный реестр документации Поставщика","The VDR shall ultimately list all individual documents provided by Vendor to satisfy Company’s requirements.","Главный реестр документации Поставщик должен содержать информацию обо всех документах, предоставляемых Поставщиком в соответствии с требованиями Компании."]
[{"$nulls":3},"Vendor shall provide a VDR indicating the proposed documentation and data to be submitted for the requisitioned items based on the VDR codes defined by this document.  Sub-Vendor data shall also be included.","Поставщик должен предоставить Реестр с перечнем документации и указанием сроков выпуска по позициям оборудования и материалов в заявке, руководствуясь кодами VDR, указанными в настоящем документе.  В Реестр должны быть также включены документы Субпоставщиков. "]
[{"$nulls":3},"The following issues of the VDR are required:","Требуется предусмотреть выпуск следующих редакций Реестра:"]
[{"$nulls":3},"·        With proposal, confirming acceptance of Company’s Vendor Data Requirements Listing (VDRL) provided with the requisition.","·        Вместе с предложением для подтверждения соответствия перечню требований Компании к документации поставщиков, включенному в заявку на закупку оборудования и материалов."]
[{"$nulls":3},"·        Within 2 weeks of Purchase Order (P.O.) award.","·        Через 2 недели после присуждения Поставщику заказа на поставку."]
[{"$nulls":3},"Monthly thereafter through to completion of the P.O. requirements.","Каждый месяц вплоть до выполнения всех требований заказа на поставку."]
["A02","Detailed Drawings Register and General Guidelines","Ведомость рабочих чертежей основного комплекта и общие указания","·        Cover sheet of detailed drawings package;","·        Заглавный лист основного комплекта;"]
[{"$nulls":3},"·        Detailed Drawings Register;","·        Ведомость рабочих чертежей основного комплекта;"]
[{"$nulls":3},"·        General Guidelines","·        Общие указания"]
[null,"B - Commercial Data","B - Коммерческие данные"]
["B01","Fabrication/Production Schedule","График изготовления / производства","Schedule to bar chart form, showing design, manufacture, inspection, testing and delivery of all equipment, materials and components to be delivered by Vendor and his Sub-vendors.","График в виде гистограммы с указанием сроков проектирования, изготовления, испытаний, инспекций и поставки всего оборудования, материалов и компонентов, поставляемых Поставщиком и его Субпоставщиками."]
[{"$nulls":3},"Earliest and latest completion dates shall be entered alongside each activity with float indicated. Once agreed with Purchaser, the \"planned\" dates shall not change without prior approval by Purchaser.","Для каждого видам деятельности должны быть указаны минимальные и максимальные сроки выполнения. После согласования с Покупателем плановые сроки не должны корректироваться без получения предварительного согласия со стороны Покупателя."]
[{"$nulls":3},"Progress to date shall be clearly shown against each activity. Procurement and delivery of sub- vendor items with names and references to be included.","По каждому виду деятельности должен быть ясно указан текущий показатель завершения. Необходимо указывать сведения о закупке и доставке изделий Субпоставщиков, включая  наименования и справочную информацию."]
[{"$nulls":3},"Summary schedule of issue dates required for all documents in VDR (Ref. VDR Code A01) grouped by prime category, in bar chart format to show relationship with the Fabrication/Production Schedule. Schedule to show calendar dates.","Сводный график сроков выпуска всех требуемых документов согласно Реестру (см. документ с кодом А01) группируется по основным категориям в виде гистограммы для отображения связи с графиком изготовления / производства. В графике должны указываться календарные даты."]
[]
[{"$nulls":3},"WHERE PURCHASE ORDER REQUIRES THE ISSUE OF A MONTHLY REPORT THIS DOCUMENT SHALL BE INCLUDED UNDER DATA CODE B03 AFTER FIRST SUBMISSION.","ЕСЛИ СОГЛАСНО ЗАКАЗУ НА ПОСТАВКУ ТРЕБУЕТСЯ ВЫПУСК ЕЖЕМЕСЯЧНОГО ОТЧЕТА, ДАННЫЙ ДОКУМЕНТ, ПОСЛЕ ПЕРВОГО ВЫПУСКА, ДОЛЖЕН ИМЕТЬ КОД В03."]
["B02","Sub-Order Schedule","График субзаказов","Schedule shall show all sub-orders to be placed by Supplier.  Against each entry Supplier shall indicate anticipated award date and the latest data by which sub-order must be placed to meet the overall schedule.  Supplier shall submit unpriced copies of sub-orders at the time of order placement.","График должен отображать все субзаказы, которые будет размещать Поставщик.  По каждой такой позиции Поставщик должен указать предполагаемую дату присуждения субзаказа и крайний срок размещения субзаказа с целью соблюдения общего графика.   В момент размещения заказа Поставщик должен предоставлять копии субзаказов без указания цен."]
{"$rows_left_out":976}
{"sheet":"Справочник для бумаги","index":3,"n_rows":6,"n_cols":4,"rows_kept":6,"hidden":true}
["Код документа поставщика /VDR code",null,"Наименование документа / Document","Наименование документа / Document"]
["K30","X","Manufacturing Data Book","Журнал производственных данных"]
["K32","X","Technical Passport","Технический паспорт"]
["K45","X","Сertificates of primary verification","Сертификаты/свидетельства о первичной поверке"]
["K46","X","Certificate / passport quality","Сертификат/паспорт качества"]
["R01","X","Installation, Commissioning, Operating & Maintenance Manuals","Руководства по монтажу, пусконаладке, эксплуатации и техническому обслуживанию"]